{"text_format":"1","workbook":"xlsx","n_sheets":6,"sheets":["Calculation","Index","PersonalIncomeTaxRate20241","PersonalIncomeTaxRate2025","State Conformity ","Chart Backup"],"not_rendered":{"charts":0,"images":3,"macros":1,"external_links":0,"defined_names":30,"comments":0,"pivot_tables":0},"unopened":[],"bounds":{"document_bytes":16777216,"sheet_cells":100000,"rows_first":2000,"rows_last":500,"rows_between":2000,"halvings":0,"cell_chars":16384,"cell_head_chars":4096},"cells_cut":0,"cells_raw":0,"read":"whole","date_system":"1900"}

{"sheet":"Calculation","index":0,"n_rows":71,"n_cols":15,"rows_kept":71,"cut":false,"hidden":false,"merged":[[69,1,69,16],[70,1,70,16]]}
[]
[]
[]
[]
[]
[null,"This communication is not intended to constitute tax advice. You should seek advice based on your particular circumstances"]
[null," from your independent tax advisor. The information is subject to the Disclosure Statement below."]
[]
[null,"Hypothetical Calculation of Potential Tax Benefits of Qualified Opportunity Zone Investment"]
[]
[null,null,"Inputs",null,null,null,null,null,null,null,"Calculated Assumptions"]
[]
[null,null,"Initial Capital Gain/Commitment ($)",null,null,null,null,1000000,null,null,"LT Capital Gain Tax Rate",null,null,null,0.2]
[null,null,"Net Investment Income Tax",null,null,null,null,"Yes",null,null,"Net Investment Income Tax Rate",null,null,null,{"$f":"IF(H14=\"Yes\", 3.8%, 0%)","v":3.7999999999999999E-2}]
[null,null,"Taxpayer's State",null,null,null,null,"CT",null,null,"Federal Income Tax Rate",null,null,null,0.37]
[null,null,"Annual Growth for Non-QOF",null,null,null,null,0.09,null,null,"Taxpayer's State Tax Rate",null,null,null,{"$f":"VLOOKUP(H15, Index!$A$4:$B$54, 2, FALSE)","v":6.9900000000000004E-2}]
[null,null,"Year of Investment",null,null,null,null,2025,null,null,"State Conformity to OZ",null,null,null,{"$f":" VLOOKUP(H15, Index!$A$4:$D$54, 3, FALSE)","v":"Yes"}]
[null,null,null,null,null,null,null,null,null,null,"Growth for QOF",null,null,null,{"$f":"H16","v":0.09}]
[null,null,null,null,null,null,null,null,null,null,"Eligible for Step-Up in Basis",null,null,null,{"$f":"IF(2026-H17>=7, 15%, IF(2026-H17>=5, 10%, 0))","v":0}]
[]
[]
[null,null,"Illustration"]
[]
[]
[null,null,null,null,null,null,null,null,null,null,null,null,"Non-QOF",null,"QOF"]
[null,null,"Investment Year: 2025"]
[null,null,"Capital Gain",null,null,null,null,null,null,null,null,null,{"$f":"H13","v":1000000},null,{"$f":"H13","v":1000000}]
[null,null,"Taxes",null,null,null,null,null,null,null,null,null,{"$f":"-(O13+O14+O16)*H13","v":-307900},null,{"$f":"-IF(O17=\"Yes\", 0, O27*O16)","v":0}]
[]
[null,null,"End of Deferral Period: 2026"]
{"$rows_left_out":42}
{"sheet":"Index","index":1,"n_rows":54,"n_cols":4,"rows_kept":54,"cut":false,"hidden":true,"merged":[]}
[]
[]
[null,"Indiv Tax Rate","State Conformity","Comments"]
["AK",0,"N/A"]
["AL",0.05,"No","5% but is it 0% for capital gain."]
["AR",3.9E-2,"No"]
["AZ",2.5000000000000001E-2,"Yes"]
["CA",0.123,"No","Does not include additional 1% millionaire tax."]
["CO",4.3999999999999997E-2,"Yes"]
["CT",6.9900000000000004E-2,"Yes"]
["DC",0.1075,"Yes"]
["DE",6.6000000000000003E-2,"Yes"]
["FL",0,"N/A"]
["GA",5.1900000000000002E-2,"Yes","will be reduced by .10% annually starting Jan. 1, 2025 until rate reaches 4.99%"]
["HI",0.11,"No"]
["IA",3.7999999999999999E-2,"Yes"]
["ID",5.2999999999999999E-2,"Yes"]
["IL",4.9500000000000002E-2,"Yes"]
["IN",0.03,"Yes"]
["KS",5.5800000000000002E-2,"Yes"]
["KY",0.04,"Yes"]
["LA",0.03,"Yes"]
["MA",0.05,"No","Except for STCG at 8.5%, 3% capital gains on start up companies, and additional income surcharge of 4% for millionaires"]
["MD",5.7500000000000002E-2,"Yes"]
["ME",7.1499999999999994E-2,"Yes"]
["MI",4.2500000000000003E-2,"Yes"]
["MN",9.8500000000000004E-2,"Yes"]
["MO",4.7E-2,"Yes"]
["MS",4.3999999999999997E-2,"No"]
["MT",5.8999999999999997E-2,"Yes"]
{"$rows_left_out":25}
{"sheet":"PersonalIncomeTaxRate20241","index":2,"n_rows":66,"n_cols":4,"rows_kept":66,"cut":false,"hidden":true,"merged":[[0,0,1,3],[2,0,4,3],[5,0,6,3],[7,0,11,3],[65,0,66,4]]}
["Last Run:  May 3, 2024"]
[]
["Personal Income Tax Rate--2024"]
[]
[]
["Tax Type:Personal Income"]
[]
["This chart shows the personal income tax rate for the 2024 tax year."]
[]
[]
[]
[]
["State","Personal Income Tax Rate--2024","Authority","Editorial Reference"]
["AK","N/A","N/A","N/A"]
["AL","Ranges from 2% to 5%.\n\nSingle persons, heads of family, and married persons filing separate returns: 2% on $0 to $500; 4% on $501 to $3,000; 5% on $3,001 and over.\n\nMarried filing joint return: 2% on $0 to $1000; 4% on $1001 to $6,000; 5% on $6,001 and over.","Ala. Code  §40-18-5","58,550"]
["AR","Ranges from 0% to 4.4%.\n\nAdjusted for inflation.\n\nThe personal income tax rates for every resident, individual, trust or estate having net income less than or equal to $87,000 are as follows: from $0 to $5,099, the tax rate is 0%; from $5,100 to $10,299, the tax rate is 2%; from $10,300 to $14,699, the tax rate is 3%; from $14,700 to $24,299, the tax rate is 3.4%; and from $24,300 to $87,000, the tax rate is 4.4%. The rates for every resident, individual, trust or estate having net income greater than $87,000 are as follows: from $0 to $4,400, the tax rate is 2%; from $4,401 to $8,800, the tax rate is 4%; and from $8,801 and above, the tax rate is 4.4%. Every resident, individual, trust or estate having net income greater than or equal to $87,001 but not greater than $90,800 must reduce the amount of income tax due by deducting a statutory bracket adjustment amount.","Ark. Code Ann.  §26-51-201(a)(2)(A);Ark. Code Ann.  §26-51-201(a)(2)(B);Ark. Code Ann.  §26-51-201(a)(2)(C);Ark. Code Ann.  §26-51-201(a)(3);Ark. Code Ann.  §26-51-201(d)(1)","58,550"]
["AZ","2.5%\n\nFor tax year 2023 and beyond, there are no optional or X and Y tax tables to post due to Arizona's flat tax rate of 2.5%.","Ariz. Rev. Stat. Ann.  §43-1011(A)(7);News and Announcements, Ariz. Dept. of Rev., 12/14/2022","58,550"]
["CA","Ranges from 1% to 12.3%.\n\nAlso, there is an additional tax of 1% on taxable income exceeding $1 million. This additional tax is the mental heath services tax and is also known as the millionaire tax.","Cal. Rev. & Tax. Cd.  §17041(a);Cal. Rev. & Tax. Cd.  §17043;Cal. Constitution Art. XIII  §36(f)(2);Cal. Constitution Art. XIII  §36(f)(3)","58,550"]
["CO","4.4%.","Colo. Rev. Stat.  §39-22-104(1.7)(c)","58,550"]
["CT","2%, 4.5%, 5.5%, 6%, 6.5%, 6.9%, 6.99%.\n\nFor single filers, if Connecticut taxable income is not over $10,000, the tax rate is 2%. If taxable income is over $10,000 but not over $50,000, the tax is $200, plus 4.5% of the excess over $10,000. If taxable income is over $50,000 but not over $100,000, the tax is $2,000, plus 5.5% of the excess over $50,000. If taxable income is over $100,000 but not over $200,000, the tax is $4,750 plus 6% of the excess over $100,000. If taxable income is over $200,000 but not over $250,000, the tax is $10,750 plus 6.5% of the excess over $200,000. If taxable income is over $250,000 but not over $500,000, the tax is $14,000 plus 6.9% of the excess over $250,000. If taxable income is over $500,000, the tax is $31,250 plus 6.99% of the excess over $500,000.\nFuture rates: There is no enacted rate change at this time.","Conn. Gen. Stat.  §12-700","58,550"]
["DC","Ranges from 4% to 10.75%.","D.C. Code Ann.  §47-1806.03","58,550"]
["DE","Ranges from 2.2% to 6.6%.\n\nTaxable income of up to $2,000 = $0 tax; taxable income of over $2,000 but not over $5,000, tax = 2.2% on amounts over $2,000; taxable income of over $5,000 but not over $10,000, tax = 3.9% on amounts over $5,000; taxable income of over $10,000 but not over $20,000, tax = 4.8% on amounts over $10,000; taxable income of over $20,000 but not over $25,000, tax = 5.2% on amounts over $20,000; taxable income of over $25,000 but not over $60,000, tax = 5.55% on amounts over $25,000; taxable income of over $60,000, 6.6% on amounts over $60,000.","Del. Code Ann. 30  §1102(a)(14)","58,550"]
["FL","N/A","N/A","N/A"]
["GA","Flat rate of 5.39%.\nTo be reduced by 0.10% annually beginning on January 1, 2025, until the rate reaches 4.99%.","Ga. Code Ann.  §48-7-20 (a.1)(1)","58,550"]
["HI","Ranges from 1.4% to 11%.","Haw. Rev. Stat.  §235-51","58,550"]
["IA","Ranges from 4.40% to 5.70%.","Iowa Code  §422.5(1);2024 Interest Rates and Income Tax Brackets, Iowa Dept. of Rev., 10/25/2023","58,550"]
["ID","5.695%.\nUpdated:04/10/2024","Idaho Code  §63-3024","58,550"]
["IL","4.95%.","ILCS Chapter 35  §5/201(b)(5.2)","58,550"]
["IN","3.05%.","Ind. Code  §6-3-2-1","58,550"]
["KS","Ranges from 3.1% to 5.7%.\n\nSingle filers: If the taxable income (TI) is not over $15,000, the tax = 3.1% of Kansas taxable income; if the TI is over $15,000 but not over $30,000, the tax = $465 plus 5.25% of the excess over $15,000; if the TI is over $30,000, the tax = $1,252.50 plus 5.7% of the excess over $30,000.\n\nMarried filing jointly: If the taxable income (TI) is not over $30,000, the tax = 3.1% of Kansas taxable income If the TI is over $30,000 but not over $60,000, the tax = $930 plus 5.25% of excess over $30,000 If the TI is over $60,000, the tax = $2,505 plus 5.7% of excess over $60,000.","Kan. Stat. Ann.  §79-32,110(a)","58,550"]
{"$rows_left_out":37}
{"sheet":"PersonalIncomeTaxRate2025","index":3,"n_rows":94,"n_cols":5,"rows_kept":94,"cut":false,"hidden":true,"merged":[[93,0,94,4],[81,0,83,0],[81,1,83,1],[85,0,86,0],[85,1,86,1],[88,0,89,0],[88,1,89,1],[63,0,65,0],[63,1,65,1],[66,0,67,0],[66,1,67,1],[76,0,77,0],[76,1,77,1],[53,0,54,0],[53,1,54,1],[55,0,56,0],[55,1,56,1],[58,0,59,0],[58,1,59,1],[34,0,35,0],[34,1,35,1],[42,0,47,0],[42,1,47,1],[50,0,52,0],[50,1,52,1],[20,0,21,0],[20,1,21,1],[22,0,25,0],[22,1,25,1],[26,0,27,0],[26,1,27,1],[0,0,1,3],[2,0,4,3],[5,0,6,3],[7,0,11,3],[15,0,19,0],[15,1,19,1]]}
["Last Run:  Jul 9, 2025"]
[]
["Personal Income Tax Rate--2025"]
[]
[]
["Tax Type:Personal Income"]
[]
["This chart shows the personal income tax rate for the 2025 tax year."]
[]
[]
[]
[]
["State","Personal Income Tax Rate--2025","Authority","Editorial Reference","Changed"]
["AK","N/A","o N/A ","o N/A "]
["AL","Ranges from 2% to 5%.\nSingle persons, heads of family, and married persons filing separate returns: 2% on $0 to $500; 4% on $501 to $3,000; 5% on $3,001 and over.\n\nMarried filing joint return: 2% on $0 to $1000; 4% on $1001 to $6,000; 5% on $6,001 and over.","Ala. Code   § 40-18-5  ","58,550  "]
["AR","Ranges from 0% to 3.9%.\nAdjusted for inflation.\n\nThe personal income tax rates for every resident, individual, trust or estate having net income less than or equal to $89,600 are as follows: from $0 to $5,299, the tax rate is 0%; from $5,300 to $10,599, the tax rate is 2%; from $10,600 to $15,099, the tax rate is 3%; from $15,100 to $24,999, the tax rate is 3.4%; and from $25,000 to $89,600, the tax rate is 3.9%. The rates for every resident, individual, trust or estate having net income greater than $89,600 are as follows: from $0 to $4,500, the tax rate is 2%; and from $4,501 and above, the tax rate is 3.9%. Every resident, individual, trust or estate having net income greater than or equal to $89,601 but not greater than $92,700 must reduce the amount of income tax due by deducting a statutory bracket adjustment amount.","Ark. Code Ann.   § 26-51-201(a)(2)(A)  ","58,550  "]
[null,null,"Ark. Code Ann.   § 26-51-201(a)(2)(B)  "]
[null,null,"Ark. Code Ann.   § 26-51-201(a)(2)(C)  "]
[null,null,"Ark. Code Ann.   § 26-51-201(a)(3)  "]
[null,null,"Ark. Code Ann.   § 26-51-201(d)(1)  "]
["AZ","2.5%\nFor tax year 2023 and beyond, there are no optional or X and Y tax tables to post due to Arizona's flat tax rate of 2.5%.","Ariz. Rev. Stat. Ann.   § 43-1011(A)(7)  ","58,550  "]
[null,null,"o News and Announcements, Ariz. Dept. of Rev., 12/14/2022 "]
["CA","Ranges from 1% to 12.3%.\nAlso, there is an additional tax of 1% on taxable income exceeding $1 million. This additional tax is the mental heath services tax and is also known as the millionaire tax.","Cal. Rev. & Tax. Cd.   § 17041(a)  ","58,550  "]
[null,null,"Cal. Rev. & Tax. Cd.   § 17043  "]
[null,null,"Cal. Constitution Art.  XIII   § 36(f)(2)  "]
[null,null,"Cal. Constitution Art.  XIII   § 36(f)(3)  "]
["CO","4.4%.\nThe 2025 rate may be reduced by a specified percentage for a designated excess range if there is surplus tax revenue and the amount of the excess is greater than $300 million.","Colo. Rev. Stat.   § 39-22-104(1.7)(c)  ","58,550  "]
[null,null,"Colo. Rev. Stat.   § 39-22-627(1)(a)  "]
["CT","2%, 4.5%, 5.5%, 6%, 6.5%, 6.9%, 6.99%.\nFor single filers, if Connecticut taxable income is not over $10,000, the tax rate is 2%. If taxable income is over $10,000 but not over $50,000, the tax is $200, plus 4.5% of the excess over $10,000. If taxable income is over $50,000 but not over $100,000, the tax is $2,000, plus 5.5% of the excess over $50,000. If taxable income is over $100,000 but not over $200,000, the tax is $4,750 plus 6% of the excess over $100,000. If taxable income is over $200,000 but not over $250,000, the tax is $10,750 plus 6.5% of the excess over $200,000. If taxable income is over $250,000 but not over $500,000, the tax is $14,000 plus 6.9% of the excess over $250,000. If taxable income is over $500,000, the tax is $31,250 plus 6.99% of the excess over $500,000.\nFuture rates: There is no enacted rate change at this time.","Conn. Gen. Stat.   § 12-700  ","58,550  "]
["DC","Ranges from 4% to 10.75%.","D.C. Code Ann.   § 47-1806.03  ","58,550  "]
{"$rows_left_out":65}
{"sheet":"State Conformity ","index":4,"n_rows":131,"n_cols":5,"rows_kept":131,"cut":false,"hidden":true,"merged":[[124,0,126,0],[124,1,126,1],[124,2,126,2],[124,4,126,4],[127,0,129,0],[127,1,129,1],[127,2,129,2],[128,4,129,4],[117,0,119,0],[117,1,119,1],[117,2,119,2],[117,4,119,4],[120,0,122,0],[120,1,122,1],[111,0,114,0],[111,1,114,1],[111,2,114,2],[111,4,114,4],[115,0,116,0],[115,1,116,1],[115,2,116,2],[115,4,116,4],[120,2,122,2],[120,4,122,4],[106,0,107,0],[106,1,107,1],[106,2,107,2],[106,4,107,4],[109,0,110,0],[109,1,110,1],[109,2,110,2],[109,4,110,4],[101,0,103,0],[101,1,103,1],[101,2,103,2],[101,4,103,4],[104,0,105,0],[104,1,105,1],[104,2,105,2],[104,4,105,4],[96,0,97,0],[96,1,97,1],[96,2,97,2],[96,4,97,4],[98,0,100,0],[98,1,100,1],[98,2,100,2],[98,4,100,4],[90,0,92,0],[90,1,92,1],[90,2,92,2],[90,4,92,4],[93,0,95,0],[93,1,95,1],[93,2,95,2],[94,4,95,4],[84,0,86,0],[84,1,86,1],[84,2,86,2],[85,4,86,4],[87,0,89,0],[87,1,89,1],[87,2,89,2],[88,4,89,4],[79,0,81,0],[79,1,81,1],[79,2,81,2],[79,4,81,4],[82,0,83,0],[82,1,83,1],[82,2,83,2],[82,4,83,4],[72,0,73,0],[72,1,73,1],[72,2,73,2],[72,4,73,4],[75,0,78,0],[75,1,78,1],[75,2,78,2],[76,4,78,4],[66,0,68,0],[66,1,68,1],[66,2,68,2],[66,4,68,4],[69,0,71,0],[69,1,71,1],[69,2,71,2],[70,4,71,4],[61,0,62,0],[61,1,62,1],[61,2,62,2],[61,4,62,4],[63,0,65,0],[63,1,65,1],[63,2,65,2],[64,4,65,4],[54,0,56,0],[54,1,56,1],[54,2,56,2],[55,4,56,4],[57,0,60,0],[57,1,60,1],[57,2,60,2],[57,4,60,4],[50,0,51,0],[50,1,51,1],[50,2,51,2],[50,4,51,4],[52,0,53,0],[52,1,53,1],[52,2,53,2],[52,4,53,4],[45,0,47,0],[45,1,47,1],[45,2,47,2],[45,4,47,4],[48,0,49,0],[48,1,49,1],[48,2,49,2],[48,4,49,4],[39,0,41,0],[39,1,41,1],[39,2,41,2],[39,4,41,4],[42,0,44,0],[42,1,44,1],[42,2,44,2],[42,4,44,4],[34,0,35,0],[34,1,35,1],[34,2,35,2],[34,4,35,4],[36,0,38,0],[36,1,38,1],[36,2,38,2],[36,4,38,4],[29,0,31,0],[29,1,31,1],[29,2,31,2],[29,4,31,4],[32,0,33,0],[32,1,33,1],[32,2,33,2],[32,4,33,4],[23,0,24,0],[23,1,24,1],[23,2,24,2],[23,4,24,4],[25,0,27,0],[25,1,27,1],[25,2,27,2],[25,4,27,4],[19,0,20,0],[19,1,20,1],[19,2,20,2],[19,4,20,4],[21,0,22,0],[21,1,22,1],[21,2,22,2],[21,4,22,4],[13,0,14,0],[13,1,14,1],[13,2,14,2],[13,4,14,4],[16,0,18,0],[16,1,18,1],[16,2,18,2],[16,4,18,4],[9,0,10,0],[9,1,10,1],[9,2,10,2],[9,4,10,4],[11,0,12,0],[11,1,12,1],[11,2,12,2],[11,4,12,4],[0,0,0,4],[2,0,2,4],[4,0,4,4],[6,0,8,0],[6,1,8,1],[6,2,8,2],[6,4,8,4]]}
["CCH® State Tax SmartCharts"]
[]
["Business Income Tax> Calculation of Income> Modifications> Opportunity Zones—IRC §1400Z-1 and IRC §1400Z-2"]
[]
["Taxpayers may elect to defer gain on the sale or exchange of property if the taxpayer reinvests the gain in a qualified opportunity zone under IRC Secs. 1400Z-1 and 1400Z-2. The proceeds must be reinvested within 180 days of the sale or exchange in a qualified opportunity zone fund. The gain may be deferred until the earlier of:\n• the tax year in which the investment is sold or exchanged; or\n• December 31, 2026.\nA 10% exclusion of the deferred gain is allowed if the investment is held for at least 5 years. The exclusion amount is 15% if held for more than 7 years. If held for at least 10 years, the taxpayer can treat the basis on the date of sale as the fair market value.\n\nA qualified opportunity zone is a low income community designated as such by the U.S. Treasury after being nominated by a state governor.\n\nThis chart shows whether each state and the District of Columbia recognizes federal deferral of gain on opportunity zone investments."]
["JURISDICTION","OPPORTUNITY ZONES—IRC §1400Z-1 AND IRC §1400Z-2","COMMENT","CITATION","CCH EXPLANATION"]
["Alabama","Yes, if investment is in an approved Alabama Department of Economic and Community Affairs Qualified Opportunity Zone Fund.","","Form 20C Instructions, Corporation Income Tax Return","Alabama 10-510"]
[null,null,null,"Alabama Code §40-18-6.1"]
[null,null,null,"Alabama Code §440-18-8.1"]
["Alaska","Yes, same as federal treatment.","","Form 6000 Instructions, Corporation Net Income Tax Return","Alaska 10-510"]
[null,null,null,"Alaska Stat. §43.20.021"]
["Arizona","Yes, same as federal treatment.","","Ariz. Rev. Stat. §43-105","Arizona 10-510"]
[null,null,null,"Form 120 Instructions, Corporation Income Tax Return"]
["Arkansas","Yes, if qualified opportunity zone is located in state.","","Form AR1100CT Instructions, Corporation Income Tax Return","Arkansas 10-510"]
[null,null,null,"Ark. Code Ann. §26-51-460"]
["California","No","","Form 100 Instructions, Corporation Franchise or Income Tax Return","California 10-510"]
["Colorado","Yes, same as federal treatment.","","Colo. Rev. Stat. §39-22-304(1)","Colorado 10-510"]
[null,null,null,"Form 112 Instructions, C Corporation Income Tax Return"]
[null,null,null,"FYI Income 58"]
["Connecticut","Yes, same as federal treatment.","","Form CT-1120 Instructions, Corporation Business Tax Return","Connecticut 10-510"]
[null,null,null,"Conn. Gen. Stat. §12-217"]
["Delaware","Yes, same as federal treatment.","","Del. Code Ann. tit. 30, §1903","Delaware 10-510"]
[null,null,null,"Form CIT-TAX Instructions, Corporation Income Tax Return"]
["District of Columbia","Yes, same as federal treatment.","","D.C. Code Ann. §47-1803.02","District of Columbia 10-510"]
[null,null,null,"Form D-20 Instructions, Corporation Franchise Tax Return"]
["Florida","Yes, same as federal treatment.","","Form F-1120 Instructions, Corporate Income/Franchise and Emergency Excise Tax Return","Florida 10-510"]
[null,null,null,"Fla. Stat. ch. 220.13"]
[null,null,null,"Fla. Admin. Code Ann. r. 12C-1.013"]
["Georgia","Yes, same as federal treatment.","","Ga. Code Ann. §48-7-21(a)","Georgia 10-510"]
["Hawaii","Yes, except state limits scope to opportunity zones designated by the governor.","","Haw. Rev. Stat. §235-2.3","Hawaii 10-510"]
{"$rows_left_out":102}
{"sheet":"Chart Backup","index":5,"n_rows":121,"n_cols":18,"rows_kept":121,"cut":false,"hidden":true,"merged":[]}
[]
[]
[]
[null,null,null,"CIM Opportnuity Zone Tax Hypotheticals",null,null,"Year",0,{"$f":"H4+1","v":1},2,3,4,5,6,7,8,9,10]
[null,null,null,null,null,null,null,{"$f":"Calculation!H17","v":2025},{"$f":"H5+1","v":2026},2027,2028,2029,2030,2031,2032,2033,2034,2035]
[null,null,null,"$000s",null,null,null,{"$f":"DATE(H5,12,31)","v":"2025-12-31"},"2026-12-31","2027-12-31","2028-12-31","2029-12-31","2030-12-31","2031-12-31","2032-12-31","2033-12-31","2034-12-31","2035-12-31"]
[]
[null,null,null,"2019 Fund Entry",null,"Date","Rate"]
[null,null,null,"Contribution",null,"Hold",10,{"$f":"-Calculation!H13","v":-1000000}]
[null,null,null,"Basis Adj.",null,null,{"$f":"Calculation!O19","v":0},{"$f":"H9*(1-G10)","v":-1000000}]
[null,null,null,"Deferred Cap Gain Tax ",null,2026,0.23799999999999999,{"$f":"IF(H5=$F$11,Calculation!$O$32,0)","v":0},{"$f":"IF(I5=$F$11,Calculation!$O$32,0)","v":-307900},{"$f":"IF(J5=$F$11,Calculation!$O$32,0)","v":0},{"$f":"IF(K5=$F$11,Calculation!$O$32,0)","v":0},{"$f":"IF(L5=$F$11,Calculation!$O$32,0)","v":0},{"$f":"IF(M5=$F$11,Calculation!$O$32,0)","v":0},{"$f":"IF(N5=$F$11,Calculation!$O$32,0)","v":0},{"$f":"IF(O5=$F$11,Calculation!$O$32,0)","v":0},{"$f":"IF(P5=$F$11,Calculation!$O$32,0)","v":0},{"$f":"IF(Q5=$F$11,Calculation!$O$32,0)","v":0},{"$f":"IF(R5=$F$11,Calculation!$O$32,0)","v":0}]
[null,null,null,"State Tax (net of federal benefit)",null,null,null,{"$f":"Calculation!O28","v":0},null,null,null,null,null,null,null,null,null,{"$f":"Calculation!O37","v":0}]
[null,null,null,"NAV",null,"Growth",{"$f":"Calculation!H16","v":0.09},{"$f":"-H9","v":1000000},{"$f":"H13*(1+$G$13)","v":1090000},1188100,1295029,1411581.61,1538623.9549000002,1677100.1108410005,1828039.1208166906,1992562.641690193,2171893.2794423103,2367363.6745921182]
[null,null,null,"Total",null,null,null,{"$f":"H9+H11+IF(H4=$G$9,H13,0)","v":-1000000},-307900,0,0,0,0,0,0,0,0,{"$f":"R9+R11+IF(R4=$G$9,R13,0)+R12","v":2367363.6745921182}]
[null,null,null,"Pre-Tax ",null,null,null,{"$f":"H9","v":-1000000},null,null,null,null,null,null,null,null,null,{"$f":"R13","v":2367363.6745921182}]
[]
[null,null,null,"Pre-Tax IRR",null,{"$f":"XIRR(H15:R15,H6:R6)","v":8.9948561787605311E-2}]
[null,null,null,"IRR",null,{"$f":"XIRR(H14:R14,H6:R6)","v":6.2578269839286785E-2}]
[null,null,null,"MOIC",null,{"$f":"SUMIF(H14:R14,\">\"&0)/-SUMIF(H14:R14,\"<\"&0)","v":1.8100494491873371}]
[]
[null,null,null,"CIM Opportnuity Zone Tax Hypotheticals",null,null,"Year",0,{"$f":"H21+1","v":1},2,3,4,5,6,7,8,9,10]
[null,null,null,null,null,null,null,2020,{"$f":"H22+1","v":2021},2022,2023,2024,2025,2026,2027,2028,2029,2030]
[null,null,null,"$000s",null,null,null,{"$f":"DATE(H22,12,31)","v":"2020-12-31"},"2021-12-31","2022-12-31","2023-12-31","2024-12-31","2025-12-31","2026-12-31","2027-12-31","2028-12-31","2029-12-31","2030-12-31"]
[]
[null,null,null,"2020 Fund Entry ",null,"Date","Rate"]
[null,null,null,"Contribution",null,"Hold",10,-1000000]
[null,null,null,"Basis Adj.",null,null,0.1,{"$f":"H26*(1-G27)","v":-900000}]
[null,null,null,"Deferred Cap Gain Tax ",null,2026,0.23799999999999999,{"$f":"IF(H22=$F$28,$H$27*$G$28,0)","v":0},0,0,0,0,0,-214200,0,0,0,0]
[null,null,null,"NAV",null,"Growth",0.09,{"$f":"-H26","v":1000000},{"$f":"H29*(1+$G$85)","v":1090000},1188100,1295029,1411581.61,1538623.9549000002,1677100.1108410005,1828039.1208166906,1992562.641690193,2171893.2794423103,2367363.6745921182]
[null,null,null,"Total",null,null,null,{"$f":"H26+H28+IF(H21=$G$9,H29,0)","v":-1000000},0,0,0,0,0,-214200,0,0,0,2367363.6745921182]
{"$rows_left_out":91}